Tetracyano-p-quinodimethane anion

Gas phase thermochemistry data

Data compiled by: John E. Bartmess

Quantity Value Units Method Reference Comment
Δfgas500. ± 13.kJ/molR-EAKlots, Compton, et al., 1974Bound excited states: Brinkman, Gunther, et al., 1994.

References

Klots, Compton, et al., 1974
Klots, C.E.; Compton, R.N.; Raaen, V.F., Electronic and ionic properties of of molecular TTF and TCMQ, J. Chem. Phys., 1974, 60, 1177. [all data]

Brinkman, Gunther, et al., 1994
Brinkman, E.A.; Gunther, E.; Schafer, O.; Brauman, J.I., Bound Excited Electronic States of Anions, J. Chem. Phys., 1994, 100, 3, 1840, https://doi.org/10.1063/1.466535 . [all data]