Fluoranthene anion
- Formula: C16H10-
- Molecular weight: 202.2511

Gas phase thermochemistry data

Data compiled by: John E. Bartmess
Quantity | Value | Units | Method | Reference | Comment |
---|---|---|---|---|---|
ΔfH°gas | 230.6 | kJ/mol | R-EA | Michl, 1969 |

References

Michl, 1969
Michl, J.,
Electronic Spectrum of Fluoranthene,
J. Molec. Spectros., 1969, 30, 1-3, 66, https://doi.org/10.1016/0022-2852(69)90236-7
. [all data]