CoC3 radical anion

Gas phase ion energetics data

Data compiled by: John E. Bartmess

Electron affinity of neutral species

EAneutral (eV) Method Reference Comment
1.550 ± 0.060LPESWang and Li, 2000Vertical Detachment Energy: 1.60±0.06 eV

References

Wang and Li, 2000
Wang, L.S.; Li, X., Vibrationally resolved photoelectron spectroscopy of the first row transition metal and C-3 clusters: MC3- (M=Sc, V, Cr, Mn, Fe, Co, and Ni), J. Chem. Phys., 2000, 112, 8, 3602-3608, https://doi.org/10.1063/1.480513 . [all data]