2-carboxy-3-aza-phenoxide anion

Reaction thermochemistry data

Data compiled by: John E. Bartmess

Individual Reactions

C6H4NO3- + Hydrogen cation = 3-Hydroxypicolinic acid

By formula: C6H4NO3- + H+ = C6H5NO3

Quantity Value Units Method Reference Comment
Δr1365. ± 11.kJ/molIMRBBreuker, Knochenmuss, et al., 1999gas phase; Acid: 2-hydroxypicolinic acid

References

Breuker, Knochenmuss, et al., 1999
Breuker, K.; Knochenmuss, R.; Zenobi, R., Gas-phase basicities of deprotonated matrix-assisted laser desorption/ionization matrix molecules, Int. J. Mass Spectrom., 1999, 184, 1, 25-38, https://doi.org/10.1016/S1387-3806(98)14200-8 . [all data]