Cyclobutane, octafluoro- anion

Gas phase thermochemistry data

Data compiled by: John E. Bartmess

Quantity Value Units Method Reference Comment
Δfgas-1603. ± 12.kJ/molR-EAMiller, Freidman, et al., 2004Re-determination of foreward/reverse rates constants, to refute Hiraoka, Mizuno, et al., 2002 higher value.See also Bopp, Roscioli, et al., 2007

References

Miller, Freidman, et al., 2004
Miller, T.M.; Freidman, J.F.; Viggiano, A.A., Electron Attachment and detachment and the Electron Affinity of cyclo-C4F8, J. Chem. Phys., 2004, 120, 15, 7024-7028, https://doi.org/10.1063/1.1683082 . [all data]

Hiraoka, Mizuno, et al., 2002
Hiraoka, K.; Mizuno, T.; Eguchi, D.; Takao, K.; Iino, T.; Yamabe, S., Gas-phase ion/molecule reactions in octafluorocyclobutane, J. Chem. Phys., 2002, 116, 17, 7574-7582, https://doi.org/10.1063/1.1400787 . [all data]

Bopp, Roscioli, et al., 2007
Bopp, J.C.; Roscioli, J.R.; Johnson, M.A.; Miller, T.M.; Viggiano, A.A.; Villano, S.M.; Wren, S.W.; Lineberger, Spectroscopic characterization of the isolated SF6- and C4F8- anions: Observation of very long harmonic progressions in symmetric deformation modes upon photodetachment, J. Phys. Chem. A, 2007, 111, 7, 1214-1221, https://doi.org/10.1021/jp0665372 . [all data]