Phosphorus, mol. (P4) anion

Gas phase thermochemistry data

Data compiled by: John E. Bartmess

Quantity Value Units Method Reference Comment
Δfgas<-71.1 ± 5.0kJ/molR-EAJones, Ganteför, et al., 1995Stated electron affinity is the Vertical Detachment Energy

References

Jones, Ganteför, et al., 1995
Jones, R.O.; Ganteför, G.; Hunsicker, S.; Pieperhoff, P., Structure and Spectroscopy of Phosphorous Cluster anions: Theory (simulated annealing) and Experiment (Photoelectron Detachment), J. Chem. Phys., 1995, 103, 22, 9549, https://doi.org/10.1063/1.469969 . [all data]