Benzophenone anion
- Formula: C13H10O-
- Molecular weight: 182.2184

Gas phase thermochemistry data

Data compiled by: John E. Bartmess
Quantity | Value | Units | Method | Reference | Comment |
---|---|---|---|---|---|
ΔfH°gas | -1.2 ± 2.5 | kcal/mol | R-EA | Grimsrud, Caldwell, et al., 1985 | ΔGea(423 K) = -15.3 kcal/mol; ΔSea (estimated) = +2.0 eu |

Ion clustering data

Data compiled by: John E. Bartmess
Clustering reactions
C13H10O- + = C13H10F4OSi-
By formula: C13H10O- + F4Si = C13H10F4OSi-
Quantity | Value | Units | Method | Reference | Comment |
---|---|---|---|---|---|
ΔrG° | 22.00 ± 0.60 | kcal/mol | IMRE | Williamson, Knighton, et al., 2001 | gas phase; at 150 C |

References

Grimsrud, Caldwell, et al., 1985
Grimsrud, E.; Caldwell, G.; Kebarle, P.,
Electron affinities from electron transfer equilibria: A- + B = A + B-,
J. Am. Chem. Soc., 1985, 107, 4627. [all data]
Williamson, Knighton, et al., 2001
Williamson, D.H.; Knighton, W.B.; Grimsrud, E.P.,
Lewis acid-base interactions of SiF4 with molecular anions formed by electron capture reactions,
Int. J. Mass Spectrom., 2001, 206, 1-2, 53-61, https://doi.org/10.1016/S1387-3806(00)00388-2
. [all data]