oF-C6H4CH2 anion
- Formula: C7H6F-
- Molecular weight: 109.1215

Reaction thermochemistry data

Data compiled by: John E. Bartmess
Individual Reactions
By formula: C7H6F- + H+ = C7H7F
Quantity | Value | Units | Method | Reference | Comment |
---|---|---|---|---|---|
ΔrH° | 375.4 ± 3.0 | kcal/mol | D-EA | Kim, Wenthold, et al., 1999 | gas phase |
Quantity | Value | Units | Method | Reference | Comment |
ΔrG° | 368.3 ± 3.1 | kcal/mol | H-TS | Kim, Wenthold, et al., 1999 | gas phase |

References

Kim, Wenthold, et al., 1999
Kim, J.B.; Wenthold, P.G.; Lineberger, W.C.,
Ultraviolet photoelectron spectroscopy of o-, m-, and p-halobenzyl anions,
J. Phys. Chem. A, 1999, 103, 50, 10833-10841, https://doi.org/10.1021/jp992817o
. [all data]