gold anion
- Formula: Au-
- Molecular weight: 196.967118

Gas phase thermochemistry data

Data compiled by: John E. Bartmess
Quantity | Value | Units | Method | Reference | Comment |
---|---|---|---|---|---|
ΔfH°gas | 144. ± 11. | kJ/mol | Acid | Hotop and Lineberger, 1973 |

Ion clustering data

Data compiled by: John E. Bartmess
Clustering reactions
Au- + = C6AuF6-
By formula: Au- + C6F6 = C6AuF6-
Quantity | Value | Units | Method | Reference | Comment |
---|---|---|---|---|---|
ΔrH° | 100. ± 17. | kJ/mol | N/A | Ho and Dunbar, 1999 | gas phase |

Gas phase ion energetics data

Data compiled by: John E. Bartmess
Protonation reactions
Au- + = HAu
Quantity | Value | Units | Method | Reference | Comment |
---|---|---|---|---|---|
ΔrH° | 329.3 ± 1.9 | kcal/mol | D-EA | Hotop and Lineberger, 1973 | gas phase |
Quantity | Value | Units | Method | Reference | Comment |
ΔrG° | 324.1 ± 2.0 | kcal/mol | H-TS | Hotop and Lineberger, 1973 | gas phase |

References

Hotop and Lineberger, 1973
Hotop, H.; Lineberger, W.C.,
Dye-laser Photodetachment Studies of Au-, Pt-, PtN-, and Ag-,
J. Chem. Phys., 1973, 58, 6, 2379, https://doi.org/10.1063/1.1679515
. [all data]
Ho and Dunbar, 1999
Ho, Y.P.; Dunbar, R.C.,
Reactions of Au+ and Au- with benzene and fluorine-substituted benzenes,
Int. J. Mass Spectrom., 1999, 183, 175-184, https://doi.org/10.1016/S1387-3806(98)14245-8
. [all data]