(coronene)2 radical anion
- Formula: C48H24-
- Molecular weight: 600.7047

Gas phase ion energetics data

Data compiled by: John E. Bartmess
Electron affinity of neutral species
EAneutral (eV) | Method | Reference | Comment |
---|---|---|---|
0.670 ± 0.090 | LPES | Duncan, Knight, et al., 1999 |

References

Duncan, Knight, et al., 1999
Duncan, M.A.; Knight, A.M.; Negishi, Y.; Nagao, S.; Nakamura, Y.; Kato, A.; Nakajima, A.; Kaya, K.,
Production of jet-cooled coronene and coronene cluster anions and their study with photoelectron spectroscopy,
Chem. Phys. Lett., 1999, 309, 1-2, 49-54, https://doi.org/10.1016/S0009-2614(99)00662-4
. [all data]