Al4C anion

Gas phase ion energetics data

Data compiled by: John E. Bartmess

Electron affinity of neutral species

EAneutral (eV) Method Reference Comment
1.93 ± 0.22LPESLi, Wang, et al., 1999Vertical Detachment Energy: 2.65±0.06 eV. Anion is C-centered planar; neutral, tetrahedral

References

Li, Wang, et al., 1999
Li, X.; Wang, L.S.; Boldyrev, A.I.; Simons, J., Tetracoordinated planar carbon in the Al4C- anion. A combined photoelectron spectroscopy and ab initio study, J. Am. Chem. Soc., 1999, 121, 25, 6033-6038, https://doi.org/10.1021/ja9906204 . [all data]