Menadione anion
- Formula: C11H8O2-
- Molecular weight: 172.1806

Gas phase thermochemistry data

Data compiled by: John E. Bartmess
Quantity | Value | Units | Method | Reference | Comment |
---|---|---|---|---|---|
ΔfH°gas | -297. ± 10. | kJ/mol | R-EA | Heinis, Chowdhury, et al., 1988 | ΔGea(423 K) = -38.5 kcal/mol; ΔSea(estimated) = -4.0 eu |

References

Heinis, Chowdhury, et al., 1988
Heinis, T.; Chowdhury, S.; Scott, S.L.; Kebarle, P.,
Electron Affinities of Benzo-, Naphtho-, and Anthraquinones Determined from Gas-Phase Equilibria Measurements,
J. Am. Chem. Soc., 1988, 110, 2, 400, https://doi.org/10.1021/ja00210a015
. [all data]