C70Na radical anion

Gas phase ion energetics data

Data compiled by: John E. Bartmess

Electron affinity of neutral species

EAneutral (eV) Method Reference Comment
2.20 ± 0.11LPESPalpant, Otake, et al., 1999Vertical Detachment Energy: 2.45 eV

References

Palpant, Otake, et al., 1999
Palpant, B.; Otake, A.; Hayakawa, F.; Negishi, Y.; Lee, G.H.; Nakajima, A.; Kaya, K., Photoelectron spectroscopy of sodium-coated C-60 and C-70 cluster anions, Phys. Rev. B: Cond. Matt., 1999, 60, 7, 4509-4512, https://doi.org/10.1103/PhysRevB.60.4509 . [all data]