PhCHCl anion
- Formula: C7H6Cl-
- Molecular weight: 125.576

Gas phase ion energetics data

Data compiled by: John E. Bartmess
Protonation reactions
By formula: C7H6Cl- + H+ = C7H7Cl
Quantity | Value | Units | Method | Reference | Comment |
---|---|---|---|---|---|
ΔrH° | 372.0 ± 2.1 | kcal/mol | G+TS | Poutsma, Nash, et al., 1997 | gas phase |
Quantity | Value | Units | Method | Reference | Comment |
ΔrG° | 364.9 ± 2.0 | kcal/mol | IMRB | Poutsma, Nash, et al., 1997 | gas phase |

References

Poutsma, Nash, et al., 1997
Poutsma, J.C.; Nash, J.J.; Paulino, J.A.; Squires, R.R.,
Absolute Heats of Formation of Phenylcarbene and Vinylcarbene,
J. Am. Chem. Soc., 1997, 119, 20, 4686, https://doi.org/10.1021/ja963918s
. [all data]