platinum anion
- Formula: Pt-
- Molecular weight: 195.085

Gas phase ion energetics data

Data compiled by: John E. Bartmess
Protonation reactions
Pt- + = HPt
Quantity | Value | Units | Method | Reference | Comment |
---|---|---|---|---|---|
ΔrH° | 1443.0 | kJ/mol | D-EA | Bilodeau, Scheer, et al., 1999 | gas phase |

Gas phase thermochemistry data

Data compiled by: John E. Bartmess
Quantity | Value | Units | Method | Reference | Comment |
---|---|---|---|---|---|
ΔfH°gas | 86.09 | kcal/mol | Acid | Bilodeau, Scheer, et al., 1999 |

Reaction thermochemistry data

Data compiled by: John E. Bartmess
Individual Reactions
Pt- + = HPt
Quantity | Value | Units | Method | Reference | Comment |
---|---|---|---|---|---|
ΔrH° | 344.89 | kcal/mol | D-EA | Bilodeau, Scheer, et al., 1999 | gas phase |

References

Bilodeau, Scheer, et al., 1999
Bilodeau, R.C.; Scheer, M.; Haugen, H.K.; Brooks, R.L.,
Near-threshold Laser Spectroscopy of Iridium and Platinum Negative Ions: Electron Affinities and the Threshold Law,
Phys. Rev. A, 1999, 61, 1, 12505, https://doi.org/10.1103/PhysRevA.61.012505
. [all data]