AlH2 anion
- Formula: AlH2-
- Molecular weight: 28.99797

Reaction thermochemistry data

Data compiled by: John E. Bartmess
Individual Reactions
Quantity | Value | Units | Method | Reference | Comment |
---|---|---|---|---|---|
ΔrH° | 372.90 ± 0.80 | kcal/mol | N/A | Hinde, 2000 | gas phase |
Quantity | Value | Units | Method | Reference | Comment |
ΔrG° | 364.90 ± 0.90 | kcal/mol | H-TS | Hinde, 2000 | gas phase |

Gas phase ion energetics data

Data compiled by: John E. Bartmess
Electron affinity of neutral species
EAneutral (eV) | Method | Reference | Comment |
---|---|---|---|
0.90 ± 0.10 | LPES | Zhang, Wang, et al., 2013 | Vertical Detachment Energy: 1.5±0.1 eV |
Protonation reactions
Quantity | Value | Units | Method | Reference | Comment |
---|---|---|---|---|---|
ΔrH° | 372.90 ± 0.80 | kcal/mol | N/A | Hinde, 2000 | gas phase |
Quantity | Value | Units | Method | Reference | Comment |
ΔrG° | 364.90 ± 0.90 | kcal/mol | H-TS | Hinde, 2000 | gas phase |

References

Hinde, 2000
Hinde, R.J.,
Ab initio gas-phase acidities of NaH, MgH2, and AlH3,
J. Phys. Chem. A, 2000, 104, 32, 7580-7585, https://doi.org/10.1021/jp994138j
. [all data]
Zhang, Wang, et al., 2013
Zhang, X.X.; Wang, H.P.; Collins, E.; Lim, A.; Gantefor, G.; Kiran, B.; Schnockel, H.; Eichhorn, B.; Bowen, K.,
Photoelectron spectroscopy of the aluminum hydride anions: AlH2-, AlH3-, Al2H6-, Al3H9-, and Al4H12-,
J. Chem. Phys., 2013, 138, 12, 124303, https://doi.org/10.1063/1.4796200
. [all data]