MeOCHCl anion
- Formula: C2H4ClO-
- Molecular weight: 79.506

Reaction thermochemistry data

Data compiled by: John E. Bartmess
Individual Reactions
By formula: C2H4ClO- + H+ = C2H5ClO
Quantity | Value | Units | Method | Reference | Comment |
---|---|---|---|---|---|
ΔrG° | <384.00 | kcal/mol | IMRB | Paulino and Squires, 1991 | gas phase; MeOCH2Cl is deprotonated by HO- |

References

Paulino and Squires, 1991
Paulino, J.A.; Squires, R.R.,
Carbene Anion Complexes - Unusual Structural and Thermochemical Features of alpha-Halocarbanions in the Gas Phase,
J. Am. Chem. Soc., 1991, 113, 5, 1845, https://doi.org/10.1021/ja00005a067
. [all data]