H2O..{MeOH}2..MeO anion
- Formula: C3H13O4-
- Molecular weight: 113.1335

Gas phase thermochemistry data

Data compiled by: John E. Bartmess
Quantity | Value | Units | Method | Reference | Comment |
---|---|---|---|---|---|
ΔfH°gas | -1042. ± 6.3 | kJ/mol | Ther | Meot-Ner(Mautner), 1986 |

Reaction thermochemistry data

Data compiled by: John E. Bartmess
Individual Reactions
C3H11O3- + + 2
= C3H13O4-
By formula: C3H11O3- + H2O + 2CH4O = C3H13O4-
Quantity | Value | Units | Method | Reference | Comment |
---|---|---|---|---|---|
ΔrH° | 57.7 ± 4.2 | kJ/mol | TDAs | Meot-Ner(Mautner), 1986 | gas phase |
Quantity | Value | Units | Method | Reference | Comment |
ΔrG° | 26.8 ± 2.1 | kJ/mol | TDAs | Meot-Ner(Mautner), 1986 | gas phase |

Ion clustering data

Data compiled by: John E. Bartmess
Clustering reactions
C3H11O3- + + 2
= C3H13O4-
By formula: C3H11O3- + H2O + 2CH4O = C3H13O4-
Quantity | Value | Units | Method | Reference | Comment |
---|---|---|---|---|---|
ΔrH° | 57.7 ± 4.2 | kJ/mol | TDAs | Meot-Ner(Mautner), 1986 | gas phase |
Quantity | Value | Units | Method | Reference | Comment |
ΔrG° | 26.8 ± 2.1 | kJ/mol | TDAs | Meot-Ner(Mautner), 1986 | gas phase |

References

Meot-Ner(Mautner), 1986
Meot-Ner(Mautner), M.,
Comparative Stabilities of Cationic and Anionic Hydrogen-Bonded Networks. Mixed Clusters of Water-Methanol,
J. Am. Chem. Soc., 1986, 108, 20, 6189, https://doi.org/10.1021/ja00280a014
. [all data]