(H2O)4..MeO anion
- Formula: CH11O5-
- Molecular weight: 103.0956

Gas phase thermochemistry data

Data compiled by: John E. Bartmess
Quantity | Value | Units | Method | Reference | Comment |
---|---|---|---|---|---|
ΔfH°gas | -331.3 ± 1.8 | kcal/mol | Ther | Meot-Ner(Mautner), 1986 |

Ion clustering data

Data compiled by: John E. Bartmess
Clustering reactions
CH9O4- + 4 = CH11O5-
By formula: CH9O4- + 4H2O = CH11O5-
Quantity | Value | Units | Method | Reference | Comment |
---|---|---|---|---|---|
ΔrH° | 11.0 ± 1.0 | kcal/mol | TDAs | Meot-Ner(Mautner), 1986 | gas phase |
Quantity | Value | Units | Method | Reference | Comment |
ΔrG° | 5.10 ± 0.50 | kcal/mol | TDAs | Meot-Ner(Mautner), 1986 | gas phase |

References

Meot-Ner(Mautner), 1986
Meot-Ner(Mautner), M.,
Comparative Stabilities of Cationic and Anionic Hydrogen-Bonded Networks. Mixed Clusters of Water-Methanol,
J. Am. Chem. Soc., 1986, 108, 20, 6189, https://doi.org/10.1021/ja00280a014
. [all data]