(H2O)2..MeO anion
- Formula: CH7O3-
- Molecular weight: 67.0650

Gas phase thermochemistry data

Data compiled by: John E. Bartmess
Quantity | Value | Units | Method | Reference | Comment |
---|---|---|---|---|---|
ΔfH°gas | -794.5 ± 4.6 | kJ/mol | Ther | Meot-Ner(Mautner), 1986 |

Ion clustering data

Data compiled by: John E. Bartmess
Clustering reactions
CH5O2- + 2 = CH7O3-
By formula: CH5O2- + 2H2O = CH7O3-
Quantity | Value | Units | Method | Reference | Comment |
---|---|---|---|---|---|
ΔrH° | 80.3 ± 4.2 | kJ/mol | TDAs | Meot-Ner(Mautner), 1986 | gas phase |
Quantity | Value | Units | Method | Reference | Comment |
ΔrG° | 49.0 ± 2.1 | kJ/mol | TDAs | Meot-Ner(Mautner), 1986 | gas phase |
CH7O3- + 3 = CH9O4-
By formula: CH7O3- + 3H2O = CH9O4-
Quantity | Value | Units | Method | Reference | Comment |
---|---|---|---|---|---|
ΔrH° | 61.9 ± 4.2 | kJ/mol | TDAs | Meot-Ner(Mautner), 1986 | gas phase |
Quantity | Value | Units | Method | Reference | Comment |
ΔrG° | 31.4 ± 2.1 | kJ/mol | TDAs | Meot-Ner(Mautner), 1986 | gas phase |

References

Meot-Ner(Mautner), 1986
Meot-Ner(Mautner), M.,
Comparative Stabilities of Cationic and Anionic Hydrogen-Bonded Networks. Mixed Clusters of Water-Methanol,
J. Am. Chem. Soc., 1986, 108, 20, 6189, https://doi.org/10.1021/ja00280a014
. [all data]