(H2O)2..{MeOH}..MeO anion
- Formula: C2H11O4-
- Molecular weight: 99.1069

Gas phase thermochemistry data

Data compiled by: John E. Bartmess
Quantity | Value | Units | Method | Reference | Comment |
---|---|---|---|---|---|
ΔfH°gas | -1074. ± 6.3 | kJ/mol | Ther | Meot-Ner(Mautner), 1986 |

Reaction thermochemistry data

Data compiled by: John E. Bartmess
Individual Reactions
C2H9O3- + 2 +
= C2H11O4-
By formula: C2H9O3- + 2H2O + CH4O = C2H11O4-
Quantity | Value | Units | Method | Reference | Comment |
---|---|---|---|---|---|
ΔrH° | 63.6 ± 4.2 | kJ/mol | TDAs | Meot-Ner(Mautner), 1986 | gas phase |
Quantity | Value | Units | Method | Reference | Comment |
ΔrG° | 28.9 ± 2.1 | kJ/mol | TDAs | Meot-Ner(Mautner), 1986 | gas phase |

Ion clustering data

Data compiled by: John E. Bartmess
Clustering reactions
C2H9O3- + 2 +
= C2H11O4-
By formula: C2H9O3- + 2H2O + CH4O = C2H11O4-
Quantity | Value | Units | Method | Reference | Comment |
---|---|---|---|---|---|
ΔrH° | 63.6 ± 4.2 | kJ/mol | TDAs | Meot-Ner(Mautner), 1986 | gas phase |
Quantity | Value | Units | Method | Reference | Comment |
ΔrG° | 28.9 ± 2.1 | kJ/mol | TDAs | Meot-Ner(Mautner), 1986 | gas phase |

References

Meot-Ner(Mautner), 1986
Meot-Ner(Mautner), M.,
Comparative Stabilities of Cationic and Anionic Hydrogen-Bonded Networks. Mixed Clusters of Water-Methanol,
J. Am. Chem. Soc., 1986, 108, 20, 6189, https://doi.org/10.1021/ja00280a014
. [all data]