(MeOH)4..MeO anion
- Formula: C5H19O5-
- Molecular weight: 159.2019

Gas phase thermochemistry data

Data compiled by: John E. Bartmess
Quantity | Value | Units | Method | Reference | Comment |
---|---|---|---|---|---|
ΔfH°gas | -1255. ± 7.9 | kJ/mol | Ther | Meot-Ner(Mautner), 1986 |

Ion clustering data

Data compiled by: John E. Bartmess
Clustering reactions
C4H15O4- + 4 = C5H19O5-
By formula: C4H15O4- + 4CH4O = C5H19O5-
Quantity | Value | Units | Method | Reference | Comment |
---|---|---|---|---|---|
ΔrH° | 47.7 ± 4.2 | kJ/mol | TDAs | Meot-Ner(Mautner), 1986 | gas phase |
Quantity | Value | Units | Method | Reference | Comment |
ΔrG° | 19.7 ± 2.1 | kJ/mol | TDAs | Meot-Ner(Mautner), 1986 | gas phase |

Reaction thermochemistry data

Data compiled by: John E. Bartmess

Individual Reactions

C4H15O4- + 4Methyl Alcohol = C5H19O5-

By formula: C4H15O4- + 4CH4O = C5H19O5-

Quantity Value Units Method Reference Comment
Δr47.7 ± 4.2kJ/molTDAsMeot-Ner(Mautner), 1986gas phase
Quantity Value Units Method Reference Comment
Δr19.7 ± 2.1kJ/molTDAsMeot-Ner(Mautner), 1986gas phase

References

Meot-Ner(Mautner), 1986
Meot-Ner(Mautner), M.,
Comparative Stabilities of Cationic and Anionic Hydrogen-Bonded Networks. Mixed Clusters of Water-Methanol,
J. Am. Chem. Soc., 1986, 108, 20, 6189, https://doi.org/10.1021/ja00280a014
. [all data]