(MeOH)3..MeO anion
- Formula: C4H15O4-
- Molecular weight: 127.1600

Gas phase thermochemistry data

Data compiled by: John E. Bartmess
Quantity | Value | Units | Method | Reference | Comment |
---|---|---|---|---|---|
ΔfH°gas | -240.5 ± 1.6 | kcal/mol | Ther | Meot-Ner(Mautner), 1986 |

Ion clustering data

Data compiled by: John E. Bartmess
Clustering reactions
C3H11O3- + 3 = C4H15O4-
By formula: C3H11O3- + 3CH4O = C4H15O4-
Quantity | Value | Units | Method | Reference | Comment |
---|---|---|---|---|---|
ΔrH° | 15.0 ± 1.0 | kcal/mol | TDAs | Meot-Ner(Mautner), 1986 | gas phase |
Quantity | Value | Units | Method | Reference | Comment |
ΔrG° | 7.20 ± 0.50 | kcal/mol | TDAs | Meot-Ner(Mautner), 1986 | gas phase |
C4H15O4- + 4 = C5H19O5-
By formula: C4H15O4- + 4CH4O = C5H19O5-
Quantity | Value | Units | Method | Reference | Comment |
---|---|---|---|---|---|
ΔrH° | 11.4 ± 1.0 | kcal/mol | TDAs | Meot-Ner(Mautner), 1986 | gas phase |
Quantity | Value | Units | Method | Reference | Comment |
ΔrG° | 4.70 ± 0.50 | kcal/mol | TDAs | Meot-Ner(Mautner), 1986 | gas phase |

Reaction thermochemistry data

Data compiled by: John E. Bartmess

Individual Reactions

C3H11O3- + 3Methyl Alcohol = C4H15O4-

By formula: C3H11O3- + 3CH4O = C4H15O4-

Quantity Value Units Method Reference Comment
Δr15.0 ± 1.0kcal/molTDAsMeot-Ner(Mautner), 1986gas phase
Quantity Value Units Method Reference Comment
Δr7.20 ± 0.50kcal/molTDAsMeot-Ner(Mautner), 1986gas phase

C4H15O4- + 4Methyl Alcohol = C5H19O5-

By formula: C4H15O4- + 4CH4O = C5H19O5-

Quantity Value Units Method Reference Comment
Δr11.4 ± 1.0kcal/molTDAsMeot-Ner(Mautner), 1986gas phase
Quantity Value Units Method Reference Comment
Δr4.70 ± 0.50kcal/molTDAsMeot-Ner(Mautner), 1986gas phase

References

Meot-Ner(Mautner), 1986
Meot-Ner(Mautner), M.,
Comparative Stabilities of Cationic and Anionic Hydrogen-Bonded Networks. Mixed Clusters of Water-Methanol,
J. Am. Chem. Soc., 1986, 108, 20, 6189, https://doi.org/10.1021/ja00280a014
. [all data]