(MeOH)2..MeO anion
- Formula: C3H11O3-
- Molecular weight: 95.1182

Gas phase thermochemistry data

Data compiled by: John E. Bartmess
Quantity | Value | Units | Method | Reference | Comment |
---|---|---|---|---|---|
ΔfH°gas | -742.2 ± 5.0 | kJ/mol | Ther | Meot-Ner(Mautner), 1986 |

Reaction thermochemistry data

Data compiled by: John E. Bartmess
Individual Reactions
C3H11O3- + + 2
= C3H13O4-
By formula: C3H11O3- + H2O + 2CH4O = C3H13O4-
Quantity | Value | Units | Method | Reference | Comment |
---|---|---|---|---|---|
ΔrH° | 57.7 ± 4.2 | kJ/mol | TDAs | Meot-Ner(Mautner), 1986 | gas phase |
Quantity | Value | Units | Method | Reference | Comment |
ΔrG° | 26.8 ± 2.1 | kJ/mol | TDAs | Meot-Ner(Mautner), 1986 | gas phase |
C2H7O2- + 2 = C3H11O3-
By formula: C2H7O2- + 2CH4O = C3H11O3-
Quantity | Value | Units | Method | Reference | Comment |
---|---|---|---|---|---|
ΔrH° | 89.5 ± 4.2 | kJ/mol | TDAs | Meot-Ner(Mautner), 1986 | gas phase |
Quantity | Value | Units | Method | Reference | Comment |
ΔrG° | 54.8 ± 2.1 | kJ/mol | TDAs | Meot-Ner(Mautner), 1986 | gas phase |
C3H11O3- + 3 = C4H15O4-
By formula: C3H11O3- + 3CH4O = C4H15O4-
Quantity | Value | Units | Method | Reference | Comment |
---|---|---|---|---|---|
ΔrH° | 62.8 ± 4.2 | kJ/mol | TDAs | Meot-Ner(Mautner), 1986 | gas phase |
Quantity | Value | Units | Method | Reference | Comment |
ΔrG° | 30.1 ± 2.1 | kJ/mol | TDAs | Meot-Ner(Mautner), 1986 | gas phase |

Ion clustering data

Data compiled by: John E. Bartmess
Clustering reactions
C2H7O2- + 2 = C3H11O3-
By formula: C2H7O2- + 2CH4O = C3H11O3-
Quantity | Value | Units | Method | Reference | Comment |
---|---|---|---|---|---|
ΔrH° | 89.5 ± 4.2 | kJ/mol | TDAs | Meot-Ner(Mautner), 1986 | gas phase |
Quantity | Value | Units | Method | Reference | Comment |
ΔrG° | 54.8 ± 2.1 | kJ/mol | TDAs | Meot-Ner(Mautner), 1986 | gas phase |
C3H11O3- + 3 = C4H15O4-
By formula: C3H11O3- + 3CH4O = C4H15O4-
Quantity | Value | Units | Method | Reference | Comment |
---|---|---|---|---|---|
ΔrH° | 62.8 ± 4.2 | kJ/mol | TDAs | Meot-Ner(Mautner), 1986 | gas phase |
Quantity | Value | Units | Method | Reference | Comment |
ΔrG° | 30.1 ± 2.1 | kJ/mol | TDAs | Meot-Ner(Mautner), 1986 | gas phase |
C3H11O3- + + 2
= C3H13O4-
By formula: C3H11O3- + H2O + 2CH4O = C3H13O4-
Quantity | Value | Units | Method | Reference | Comment |
---|---|---|---|---|---|
ΔrH° | 57.7 ± 4.2 | kJ/mol | TDAs | Meot-Ner(Mautner), 1986 | gas phase |
Quantity | Value | Units | Method | Reference | Comment |
ΔrG° | 26.8 ± 2.1 | kJ/mol | TDAs | Meot-Ner(Mautner), 1986 | gas phase |

References

Meot-Ner(Mautner), 1986
Meot-Ner(Mautner), M.,
Comparative Stabilities of Cationic and Anionic Hydrogen-Bonded Networks. Mixed Clusters of Water-Methanol,
J. Am. Chem. Soc., 1986, 108, 20, 6189, https://doi.org/10.1021/ja00280a014
. [all data]