SmCl3..Cl anion
- Formula: Cl4Sm-
- Molecular weight: 292.17

Reaction thermochemistry data

Data compiled by: John E. Bartmess
Individual Reactions
+ Cl3Sm = Cl4Sm-
By formula: Cl- + Cl3Sm = Cl4Sm-
Quantity | Value | Units | Method | Reference | Comment |
---|---|---|---|---|---|
ΔrH° | 69.1 ± 3.8 | kcal/mol | TDEq | Khasanshin, Pogrebnoi, et al., 1998 | gas phase; value altered from reference due to conversion from electron convention to ion convention |
ΔrH° | 86.5 ± 5.0 | kcal/mol | TDEq | Kudin, Vorob'ev, et al., 2007 | gas phase; value altered from reference due to conversion from electron convention to ion convention |
Cl4Sm- + samarium dichloride = Cl6Sm2-
By formula: Cl4Sm- + samarium dichloride = Cl6Sm2-
Quantity | Value | Units | Method | Reference | Comment |
---|---|---|---|---|---|
ΔrH° | 55.0 ± 2.2 | kcal/mol | TDEq | Khasanshin, Pogrebnoi, et al., 1998 | gas phase; Analyzed as SmCl2..SmCl4-; value altered from reference due to conversion from electron convention to ion convention |

Gas phase thermochemistry data

Data compiled by: John E. Bartmess

Quantity Value Units Method Reference Comment
Δfgas-316.6 ± 2.4kcal/molTherKhasanshin, Pogrebnoi, et al., 1998value altered from reference due to conversion from electron convention to ion convention
Δfgas-312.8 ± 5.0kcal/molTherKudin, Vorob'ev, et al., 2007value altered from reference due to conversion from electron convention to ion convention

References

Khasanshin, Pogrebnoi, et al., 1998
Khasanshin, I.V.; Pogrebnoi, A.M.; Kudin, L.S.; Kuznetsov, A.Y.; Butman, M.F.,
The Neutral and Ionic Components of Saturated Vapor of Samarium Dichloride: The Thermochemical Characteristics of Gaseous Molecules and Ions,
High Temp., 1998, 36, 687-694. [all data]
Kudin, Vorob'ev, et al., 2007
Kudin, L.S.; Vorob'ev, D.E.; Grishin, A.E.,
The Thermochemical Characteristics of the LnCl4- and Ln2Cl7- Negative Ions,
Russ. J. Phys. Chem., 2007, 81, 2, 147, https://doi.org/10.1134/S003602440702001X
. [all data]