SmCl2..Cl anion
- Formula: Cl3Sm-
- Molecular weight: 256.72

Gas phase thermochemistry data

Data compiled by: John E. Bartmess
Quantity | Value | Units | Method | Reference | Comment |
---|---|---|---|---|---|
ΔfH°gas | -946.63 | kJ/mol | Ther | Khasanshin, Pogrebnoi, et al., 1998 | value altered from reference due to conversion from electron convention to ion convention |

Reaction thermochemistry data

Data compiled by: John E. Bartmess
Individual Reactions
+ samarium dichloride = Cl3Sm-
By formula: Cl- + samarium dichloride = Cl3Sm-
Quantity | Value | Units | Method | Reference | Comment |
---|---|---|---|---|---|
ΔrH° | 257.3 ± 2.1 | kJ/mol | TDEq | Khasanshin, Pogrebnoi, et al., 1998 | gas phase; value altered from reference due to conversion from electron convention to ion convention |

Gas phase ion energetics data

Data compiled by: John E. Bartmess
Electron affinity of neutral species
EAneutral (eV) | Method | Reference | Comment |
---|---|---|---|
2.47306 | R-A | Khasanshin, Pogrebnoi, et al., 1998 | value altered from reference due to conversion from electron convention to ion convention |

Ion clustering data

Data compiled by: John E. Bartmess
Clustering reactions
+ samarium dichloride = Cl3Sm-
By formula: Cl- + samarium dichloride = Cl3Sm-
Quantity | Value | Units | Method | Reference | Comment |
---|---|---|---|---|---|
ΔrH° | 257.3 ± 2.1 | kJ/mol | TDEq | Khasanshin, Pogrebnoi, et al., 1998 | gas phase; value altered from reference due to conversion from electron convention to ion convention |

References

Khasanshin, Pogrebnoi, et al., 1998
Khasanshin, I.V.; Pogrebnoi, A.M.; Kudin, L.S.; Kuznetsov, A.Y.; Butman, M.F.,
The Neutral and Ionic Components of Saturated Vapor of Samarium Dichloride: The Thermochemical Characteristics of Gaseous Molecules and Ions,
High Temp., 1998, 36, 687-694. [all data]