(Xe)7..I anion
- Formula: IXe7-
- Molecular weight: 1045.956

Ion clustering data

Data compiled by: John E. Bartmess
Clustering reactions
IXe6- + 7 = IXe7-
By formula: IXe6- + 7Xe = IXe7-
Quantity | Value | Units | Method | Reference | Comment |
---|---|---|---|---|---|
ΔrH° | 1.20 ± 0.90 | kcal/mol | N/A | Becker, Markovich, et al., 1997 | gas phase; Stated electron affinity is the Vertical Detachment Energy |
IXe7- + 8 = IXe8-
By formula: IXe7- + 8Xe = IXe8-
Quantity | Value | Units | Method | Reference | Comment |
---|---|---|---|---|---|
ΔrH° | 1.20 ± 0.90 | kcal/mol | N/A | Becker, Markovich, et al., 1997 | gas phase; Stated electron affinity is the Vertical Detachment Energy |

Reaction thermochemistry data

Data compiled by: John E. Bartmess

Individual Reactions

IXe6- + 7Xenon = IXe7-

By formula: IXe6- + 7Xe = IXe7-

Quantity Value Units Method Reference Comment
Δr5.0 ± 3.8kJ/molN/ABecker, Markovich, et al., 1997gas phase; Stated electron affinity is the Vertical Detachment Energy

IXe7- + 8Xenon = IXe8-

By formula: IXe7- + 8Xe = IXe8-

Quantity Value Units Method Reference Comment
Δr5.0 ± 3.8kJ/molN/ABecker, Markovich, et al., 1997gas phase; Stated electron affinity is the Vertical Detachment Energy

Gas phase ion energetics data

Data compiled by: John E. Bartmess

Electron affinity of neutral species

EAneutral (eV) Method Reference Comment
3.4680 ± 0.0060LPESPivonka, Lenzer, et al., 2001Vertical Detachment Energy:3.500±0.008 eV
3.510 ± 0.020LPESBecker, Markovich, et al., 1997Stated electron affinity is the Vertical Detachment Energy

References

Becker, Markovich, et al., 1997
Becker, I.; Markovich, G.; Chesnovsky, O.,
Bound Delocalized Excited States in I-Xen Clusters.,
Phys. Rev. Lett., 1997, 79, 18, 3391, https://doi.org/10.1103/PhysRevLett.79.3391
. [all data]