(Xe)5..I anion

Reaction thermochemistry data

Data compiled by: John E. Bartmess

Individual Reactions

IXe4- + 5Xenon = IXe5-

By formula: IXe4- + 5Xe = IXe5-

Quantity Value Units Method Reference Comment
Δr5.9 ± 3.8kJ/molN/ABecker, Markovich, et al., 1997gas phase; Stated electron affinity is the Vertical Detachment Energy

IXe5- + 6Xenon = IXe6-

By formula: IXe5- + 6Xe = IXe6-

Quantity Value Units Method Reference Comment
Δr5.0 ± 3.8kJ/molN/ABecker, Markovich, et al., 1997gas phase; Stated electron affinity is the Vertical Detachment Energy

Ion clustering data

Data compiled by: John E. Bartmess

Clustering reactions

IXe4- + 5Xenon = IXe5-

By formula: IXe4- + 5Xe = IXe5-

Quantity Value Units Method Reference Comment
Δr5.9 ± 3.8kJ/molN/ABecker, Markovich, et al., 1997gas phase; Stated electron affinity is the Vertical Detachment Energy

IXe5- + 6Xenon = IXe6-

By formula: IXe5- + 6Xe = IXe6-

Quantity Value Units Method Reference Comment
Δr5.0 ± 3.8kJ/molN/ABecker, Markovich, et al., 1997gas phase; Stated electron affinity is the Vertical Detachment Energy

References

Becker, Markovich, et al., 1997
Becker, I.; Markovich, G.; Chesnovsky, O., Bound Delocalized Excited States in I-Xen Clusters., Phys. Rev. Lett., 1997, 79, 18, 3391, https://doi.org/10.1103/PhysRevLett.79.3391 . [all data]