(Xe)4..I anion
- Formula: IXe4-
- Molecular weight: 652.077

Ion clustering data

Data compiled by: John E. Bartmess
Clustering reactions
IXe3- + 4 = IXe4-
By formula: IXe3- + 4Xe = IXe4-
Quantity | Value | Units | Method | Reference | Comment |
---|---|---|---|---|---|
ΔrH° | 1.40 ± 0.90 | kcal/mol | N/A | Becker, Markovich, et al., 1997 | gas phase; Stated electron affinity is the Vertical Detachment Energy |
IXe4- + 5 = IXe5-
By formula: IXe4- + 5Xe = IXe5-
Quantity | Value | Units | Method | Reference | Comment |
---|---|---|---|---|---|
ΔrH° | 1.40 ± 0.90 | kcal/mol | N/A | Becker, Markovich, et al., 1997 | gas phase; Stated electron affinity is the Vertical Detachment Energy |

References

Becker, Markovich, et al., 1997
Becker, I.; Markovich, G.; Chesnovsky, O.,
Bound Delocalized Excited States in I-Xen Clusters.,
Phys. Rev. Lett., 1997, 79, 18, 3391, https://doi.org/10.1103/PhysRevLett.79.3391
. [all data]