(Xe)2..I anion
- Formula: IXe2-
- Molecular weight: 389.491

Gas phase thermochemistry data

Data compiled by: John E. Bartmess
Quantity | Value | Units | Method | Reference | Comment |
---|---|---|---|---|---|
ΔfH°gas | -203.8 | kJ/mol | Ther | Becker, Markovich, et al., 1997 | Stated electron affinity is the Vertical Detachment Energy |

Ion clustering data

Data compiled by: John E. Bartmess
Clustering reactions
IXe- + 2 = IXe2-
By formula: IXe- + 2Xe = IXe2-
Quantity | Value | Units | Method | Reference | Comment |
---|---|---|---|---|---|
ΔrH° | 8.8 ± 2.1 | kJ/mol | N/A | Becker, Markovich, et al., 1997 | gas phase; Stated electron affinity is the Vertical Detachment Energy |
IXe2- + 3 = IXe3-
By formula: IXe2- + 3Xe = IXe3-
Quantity | Value | Units | Method | Reference | Comment |
---|---|---|---|---|---|
ΔrH° | 6.7 ± 3.8 | kJ/mol | N/A | Becker, Markovich, et al., 1997 | gas phase; Stated electron affinity is the Vertical Detachment Energy |

Reaction thermochemistry data

Data compiled by: John E. Bartmess

Individual Reactions

IXe- + 2Xenon = IXe2-

By formula: IXe- + 2Xe = IXe2-

Quantity Value Units Method Reference Comment
Δr8.8 ± 2.1kJ/molN/ABecker, Markovich, et al., 1997gas phase; Stated electron affinity is the Vertical Detachment Energy

IXe2- + 3Xenon = IXe3-

By formula: IXe2- + 3Xe = IXe3-

Quantity Value Units Method Reference Comment
Δr6.7 ± 3.8kJ/molN/ABecker, Markovich, et al., 1997gas phase; Stated electron affinity is the Vertical Detachment Energy

References

Becker, Markovich, et al., 1997
Becker, I.; Markovich, G.; Chesnovsky, O.,
Bound Delocalized Excited States in I-Xen Clusters.,
Phys. Rev. Lett., 1997, 79, 18, 3391, https://doi.org/10.1103/PhysRevLett.79.3391
. [all data]