tBuOO anion
- Formula: C4H9O2-
- Molecular weight: 89.1136

Gas phase ion energetics data

Data compiled by: John E. Bartmess
Electron affinity of neutral species
EAneutral (eV) | Method | Reference | Comment |
---|---|---|---|
1.196 ± 0.011 | LPES | Clifford, Wenthold, et al., 1998 |
Protonation reactions
By formula: C4H9O2- + H+ = C4H10O2
Quantity | Value | Units | Method | Reference | Comment |
---|---|---|---|---|---|
ΔrH° | 370.9 ± 2.1 | kcal/mol | G+TS | Clifford, Wenthold, et al., 1998 | gas phase |
Quantity | Value | Units | Method | Reference | Comment |
ΔrG° | 363.2 ± 2.0 | kcal/mol | IMRE | Clifford, Wenthold, et al., 1998 | gas phase |

Reaction thermochemistry data

Data compiled by: John E. Bartmess

Individual Reactions

C4H9O2- + Hydrogen cation = tert-Butyl Hydroperoxide

By formula: C4H9O2- + H+ = C4H10O2

Quantity Value Units Method Reference Comment
Δr1552. ± 8.8kJ/molG+TSClifford, Wenthold, et al., 1998gas phase
Quantity Value Units Method Reference Comment
Δr1520. ± 8.4kJ/molIMREClifford, Wenthold, et al., 1998gas phase

References

Clifford, Wenthold, et al., 1998
Clifford, E.P.; Wenthold, P.G.; Gareyev, R.; Lineberger, W.C.; DePuy, C.H.; Bierbaum, V.M.; Ellison, G.B.,
Photoelectron spectroscopy, gas phase acidity, and thermochemistry of tert-butyl hydroperoxide: Mechanisms for the rearrangement of peroxyl radicals,
J. Chem. Phys., 1998, 109, 23, 10293-10310, https://doi.org/10.1063/1.477725
. [all data]