XeI anion
- Formula: IXe-
- Molecular weight: 258.198

Gas phase thermochemistry data

Data compiled by: John E. Bartmess
Quantity | Value | Units | Method | Reference | Comment |
---|---|---|---|---|---|
ΔfH°gas | -195.1 | kJ/mol | Ther | Lenzer, Furlanetto, et al., 1998 | |
ΔfH°gas | -200.1 | kJ/mol | Ther | Wada, Kikkawa, et al., 2007 | Entropy estimated |

Ion clustering data

Data compiled by: John E. Bartmess
Clustering reactions
Quantity | Value | Units | Method | Reference | Comment |
---|---|---|---|---|---|
ΔrH° | 6.69 | kJ/mol | N/A | Lenzer, Furlanetto, et al., 1998 | gas phase |
ΔrH° | 11.7 | kJ/mol | TDAs | Wada, Kikkawa, et al., 2007 | gas phase; Entropy estimated |
Quantity | Value | Units | Method | Reference | Comment |
ΔrG° | -8.24 | kJ/mol | TDAs | Wada, Kikkawa, et al., 2007 | gas phase; Entropy estimated |
IXe- + 2 = IXe2-
By formula: IXe- + 2Xe = IXe2-
Quantity | Value | Units | Method | Reference | Comment |
---|---|---|---|---|---|
ΔrH° | 8.8 ± 2.1 | kJ/mol | N/A | Becker, Markovich, et al., 1997 | gas phase; Stated electron affinity is the Vertical Detachment Energy |

Reaction thermochemistry data

Data compiled by: John E. Bartmess

Individual Reactions

Iodide + Xenon = IXe-

By formula: I- + Xe = IXe-

Quantity Value Units Method Reference Comment
Δr6.69kJ/molN/ALenzer, Furlanetto, et al., 1998gas phase
Δr11.7kJ/molTDAsWada, Kikkawa, et al., 2007gas phase; Entropy estimated
Quantity Value Units Method Reference Comment
Δr-8.24kJ/molTDAsWada, Kikkawa, et al., 2007gas phase; Entropy estimated

IXe- + 2Xenon = IXe2-

By formula: IXe- + 2Xe = IXe2-

Quantity Value Units Method Reference Comment
Δr8.8 ± 2.1kJ/molN/ABecker, Markovich, et al., 1997gas phase; Stated electron affinity is the Vertical Detachment Energy

Gas phase ion energetics data

Data compiled by: John E. Bartmess

Electron affinity of neutral species

EAneutral (eV) Method Reference Comment
3.1270 ± 0.0050LPESPivonka, Lenzer, et al., 2001Vertical Detachment Energy:3.142±0.005 eV
3.12881 ± 0.00026ZEKELenzer, Furlanetto, et al., 1998

References

Lenzer, Furlanetto, et al., 1998
Lenzer, T.; Furlanetto, M.R.; Asmis, K.R.; Neumark, D.M.,
Zero electron kinetic energy and photoelectron spectroscopy of the XeI- anion,
J. Chem. Phys., 1998, 109, 24, 10754-10766, https://doi.org/10.1063/1.477774
. [all data]
Wada, Kikkawa, et al., 2007
Wada, A.; Kikkawa, A.; Sugiyama, T.; Hiraoka, K.,
Thermochemical Stabilities of the Gas-phase Cluster Ions of Halide Ions with Rare Gas Atoms,
Int. J. Mass Spectrom.., 2007, 267, 1-3, 284-287, https://doi.org/10.1016/j.ijms.2007.02.053
. [all data]
Becker, Markovich, et al., 1997
Becker, I.; Markovich, G.; Chesnovsky, O.,
Bound Delocalized Excited States in I-Xen Clusters.,
Phys. Rev. Lett., 1997, 79, 18, 3391, https://doi.org/10.1103/PhysRevLett.79.3391
. [all data]