Benzene, 1,3,5-trimethyl-2-nitro- anion

Gas phase thermochemistry data

Data compiled by: John E. Bartmess

Quantity Value Units Method Reference Comment
Δfgas-101. ± 10.kJ/molR-EAChowdhury, Heinis, et al., 1986ΔGea= -16.1 kcal/mol; ΔSea estimated = -1.1 eu.

References

Chowdhury, Heinis, et al., 1986
Chowdhury, S.; Heinis, T.; Grimsrud, E.P.; Kebarle, P., Entropy Changes and Electron Affinities from Gas-Phase Electron Transfer Equilibria: A- + B = A + B-, J. Phys. Chem., 1986, 90, 12, 2747, https://doi.org/10.1021/j100403a037 . [all data]