MeCO2H..CO3 radical anion
- Formula: C3H4O5-
- Molecular weight: 120.0614

Ion clustering data

Data compiled by: John E. Bartmess
Clustering reactions
CO3- + = C3H4O5-
By formula: CO3- + C2H4O2 = C3H4O5-
Quantity | Value | Units | Method | Reference | Comment |
---|---|---|---|---|---|
ΔrG° | 47.28 ± 0.84 | kJ/mol | IMRE | Viidanoja, Reiner, et al., 1998 | gas phase |
C3H4O5- + +
= C3H6O6-
By formula: C3H4O5- + H2O + C2H4O2 = C3H6O6-
Quantity | Value | Units | Method | Reference | Comment |
---|---|---|---|---|---|
ΔrG° | 19.2 ± 0.84 | kJ/mol | IMRE | Viidanoja, Reiner, et al., 2000 | gas phase |

Reaction thermochemistry data

Data compiled by: John E. Bartmess

Individual Reactions

C3H4O5- + Water + Acetic acid = C3H6O6-

By formula: C3H4O5- + H2O + C2H4O2 = C3H6O6-

Quantity Value Units Method Reference Comment
Δr4.60 ± 0.20kcal/molIMREViidanoja, Reiner, et al., 2000gas phase

CO3- + Acetic acid = C3H4O5-

By formula: CO3- + C2H4O2 = C3H4O5-

Quantity Value Units Method Reference Comment
Δr11.30 ± 0.20kcal/molIMREViidanoja, Reiner, et al., 1998gas phase

References

Viidanoja, Reiner, et al., 1998
Viidanoja, J.; Reiner, T.; Arnold, F.,
Laboratory Investigations of Negative Ion-Molecule Reactions of Formic and Acetic Acid.,
Int. J. Mass Spectrom., 1998, 181, 1-3, 31, https://doi.org/10.1016/S1387-3806(98)14151-9
. [all data]
Viidanoja, Reiner, et al., 2000
Viidanoja, J.; Reiner, T.; Kiendler, A.; Grimm, F.; Arnold, F.,
Laboratory investigations of negative ion molecule reactions of propionic, butyric, glyoxylic, pyruvic, and pinonic acids,
Int. J. Mass Spectrom., 2000, 194, 1, 53-68, https://doi.org/10.1016/S1387-3806(99)00172-4
. [all data]