iPrOH..Br anion

Gas phase thermochemistry data

Data compiled by: John E. Bartmess

Quantity Value Units Method Reference Comment
Δfgas-545.5 ± 1.2kJ/molTherBogdanov, Peschke, et al., 1999

Reaction thermochemistry data

Data compiled by: John E. Bartmess

Individual Reactions

Bromine anion + Isopropyl Alcohol = C3H8BrO-

By formula: Br- + C3H8O = C3H8BrO-

Quantity Value Units Method Reference Comment
Δr60.25 ± 0.84kJ/molTDAsBogdanov, Peschke, et al., 1999gas phase
Quantity Value Units Method Reference Comment
Δr34.9kJ/molTDAsBogdanov, Peschke, et al., 1999gas phase
Δr38. ± 8.4kJ/molIMRETanabe, Morgon, et al., 1996gas phase; Anchored to H2O..Br- of Hiraoka, Mizure, et al., 19882

Ion clustering data

Data compiled by: John E. Bartmess

Clustering reactions

Bromine anion + Isopropyl Alcohol = C3H8BrO-

By formula: Br- + C3H8O = C3H8BrO-

Quantity Value Units Method Reference Comment
Δr60.25 ± 0.84kJ/molTDAsBogdanov, Peschke, et al., 1999gas phase
Quantity Value Units Method Reference Comment
Δr34.9kJ/molTDAsBogdanov, Peschke, et al., 1999gas phase
Δr38. ± 8.4kJ/molIMRETanabe, Morgon, et al., 1996gas phase; Anchored to H2O..Br- of Hiraoka, Mizure, et al., 19882

References

Bogdanov, Peschke, et al., 1999
Bogdanov, B.; Peschke, M.; Tonner, D.S.; Szulejko, J.E.; McMahon, T.B., Stepwise solvation of halides by alcohol molecules in the gas phase, Int. J. Mass Spectrom., 1999, 187, 707-725, https://doi.org/10.1016/S1387-3806(98)14180-5 . [all data]

Tanabe, Morgon, et al., 1996
Tanabe, F.K.J.; Morgon, N.H.; Riveros, J.M., Relative Bromide and Iodide Affinity of Simple Solvent Molecules Determined by FT-ICR, J. Phys. Chem., 1996, 100, 8, 2862-2866, https://doi.org/10.1021/jp952290p . [all data]

Hiraoka, Mizure, et al., 1988
Hiraoka, K.; Mizure, S.; Yamabe, S.; Nakatsuji, Y., Gas Phase Clustering Reactions of CN- and CH2CN- with MeCN, Chem. Phys. Lett., 1988, 148, 6, 497, https://doi.org/10.1016/0009-2614(88)80320-8 . [all data]