EtOH..Br anion
- Formula: C2H6BrO-
- Molecular weight: 125.973

Gas phase thermochemistry data

Data compiled by: John E. Bartmess
Quantity | Value | Units | Method | Reference | Comment |
---|---|---|---|---|---|
ΔfH°gas | -506.8 ± 1.1 | kJ/mol | Ther | Bogdanov, Peschke, et al., 1999 |

Ion clustering data

Data compiled by: John E. Bartmess
Clustering reactions
By formula: Br- + C2H6O = C2H6BrO-
Quantity | Value | Units | Method | Reference | Comment |
---|---|---|---|---|---|
ΔrH° | 58.99 ± 0.84 | kJ/mol | TDAs | Bogdanov, Peschke, et al., 1999 | gas phase |
Quantity | Value | Units | Method | Reference | Comment |
ΔrG° | 34.3 | kJ/mol | TDAs | Bogdanov, Peschke, et al., 1999 | gas phase |
ΔrG° | 37. ± 8.4 | kJ/mol | IMRE | Tanabe, Morgon, et al., 1996 | gas phase; Anchored to H2O..Br- of Hiraoka, Mizure, et al., 19882 |

Reaction thermochemistry data

Data compiled by: John E. Bartmess

Individual Reactions

Bromine anion + Ethanol = C2H6BrO-

By formula: Br- + C2H6O = C2H6BrO-

Quantity Value Units Method Reference Comment
Δr58.99 ± 0.84kJ/molTDAsBogdanov, Peschke, et al., 1999gas phase
Quantity Value Units Method Reference Comment
Δr34.3kJ/molTDAsBogdanov, Peschke, et al., 1999gas phase
Δr37. ± 8.4kJ/molIMRETanabe, Morgon, et al., 1996gas phase; Anchored to H2O..Br- of Hiraoka, Mizure, et al., 19882

References

Bogdanov, Peschke, et al., 1999
Bogdanov, B.; Peschke, M.; Tonner, D.S.; Szulejko, J.E.; McMahon, T.B.,
Stepwise solvation of halides by alcohol molecules in the gas phase,
Int. J. Mass Spectrom., 1999, 187, 707-725, https://doi.org/10.1016/S1387-3806(98)14180-5
. [all data]
Tanabe, Morgon, et al., 1996
Tanabe, F.K.J.; Morgon, N.H.; Riveros, J.M.,
Relative Bromide and Iodide Affinity of Simple Solvent Molecules Determined by FT-ICR,
J. Phys. Chem., 1996, 100, 8, 2862-2866, https://doi.org/10.1021/jp952290p
. [all data]
Hiraoka, Mizure, et al., 1988
Hiraoka, K.; Mizure, S.; Yamabe, S.; Nakatsuji, Y.,
Gas Phase Clustering Reactions of CN- and CH2CN- with MeCN,
Chem. Phys. Lett., 1988, 148, 6, 497, https://doi.org/10.1016/0009-2614(88)80320-8
. [all data]