H3B-P(Me)2CH2 anion
- Formula: C3H11BP-
- Molecular weight: 88.905

Gas phase ion energetics data

Data compiled by: John E. Bartmess
Electron affinity of neutral species
EAneutral (eV) | Method | Reference | Comment |
---|---|---|---|
1.60 ± 0.10 | IMRB | Ren, Workman, et al., 1998 |
Protonation reactions
By formula: C3H11BP- + H+ = C3H12BP
Quantity | Value | Units | Method | Reference | Comment |
---|---|---|---|---|---|
ΔrH° | 374.6 ± 2.1 | kcal/mol | G+TS | Ren, Workman, et al., 1998 | gas phase |
Quantity | Value | Units | Method | Reference | Comment |
ΔrG° | 365.5 ± 2.0 | kcal/mol | IMRB | Ren, Workman, et al., 1998 | gas phase |

Reaction thermochemistry data

Data compiled by: John E. Bartmess
Individual Reactions
By formula: C3H11BP- + H+ = C3H12BP
Quantity | Value | Units | Method | Reference | Comment |
---|---|---|---|---|---|
ΔrH° | 374.6 ± 2.1 | kcal/mol | G+TS | Ren, Workman, et al., 1998 | gas phase |
Quantity | Value | Units | Method | Reference | Comment |
ΔrG° | 365.5 ± 2.0 | kcal/mol | IMRB | Ren, Workman, et al., 1998 | gas phase |

References

Ren, Workman, et al., 1998
Ren, J.H.; Workman, D.B.; Squires, R.R.,
Gas-phase negative ion chemistry of Lewis acid-base complexes,
J. Am. Chem. Soc., 1998, 120, 40, 10511-10522, https://doi.org/10.1021/ja9804518
. [all data]