H2O..O2C(CH2)5CO2 dianion

Gas phase thermochemistry data

Data compiled by: John E. Bartmess

Quantity Value Units Method Reference Comment
Δfgas-1198. ± 25.kJ/molTherDing, Wang, et al., 1998Affinity is EA difference from next lower solvated ion.

References

Ding, Wang, et al., 1998
Ding, C.F.; Wang, X.B.; Wang, L.S., Photoelectron spectroscopy of doubly charged anions: Intramolecular Coulomb repulsion and solvent stabilization, J. Phys. Chem. A, 1998, 102, 45, 8633-8636, https://doi.org/10.1021/jp982698x . [all data]