O2C(CH2)3CO2 dianion
- Formula: C5H6O4-2
- Molecular weight: 130.0998

Ion clustering data

Data compiled by: John E. Bartmess
Clustering reactions
C5H6O4-2 + = C5H7O4-2
By formula: C5H6O4-2 + H+ = C5H7O4-2
Quantity | Value | Units | Method | Reference | Comment |
---|---|---|---|---|---|
ΔrH° | 1732. ± 15. | kJ/mol | D-EA | Ding, Wang, et al., 1998 | gas phase |
By formula: C5H6O4-2 + H2O = (C5H6O4-2 • H2O)
Quantity | Value | Units | Method | Reference | Comment |
---|---|---|---|---|---|
ΔrH° | 34. ± 18. | kJ/mol | N/A | Ding, Wang, et al., 1998 | gas phase; Affinity is EA difference from next lower solvated ion. |
(C5H6O4-2 • ) +
= (C5H6O4-2 • 2
)
By formula: (C5H6O4-2 • H2O) + H2O = (C5H6O4-2 • 2H2O)
Quantity | Value | Units | Method | Reference | Comment |
---|---|---|---|---|---|
ΔrH° | 53. ± 18. | kJ/mol | N/A | Ding, Wang, et al., 1998 | gas phase; Affinity is EA difference from next lower solvated ion. |

References

Ding, Wang, et al., 1998
Ding, C.F.; Wang, X.B.; Wang, L.S.,
Photoelectron spectroscopy of doubly charged anions: Intramolecular Coulomb repulsion and solvent stabilization,
J. Phys. Chem. A, 1998, 102, 45, 8633-8636, https://doi.org/10.1021/jp982698x
. [all data]