p-benzyne-d4 radical anion

Gas phase thermochemistry data

Data compiled by: John E. Bartmess

Quantity Value Units Method Reference Comment
Δfgas455. ± 12.kJ/molR-EAWenthold, Squires, et al., 1998Triplet state 3.9±0.5 kcal/mol up.

References

Wenthold, Squires, et al., 1998
Wenthold, P.G.; Squires, R.R.; Lineberger, W.C., Ultraviolet photoelectron spectroscopy of the o-, m-, and p-benzyne negative ions. Electron affinities and singlet-triplet splittings for o-, m-, and p-benzyne, J. Am. Chem. Soc., 1998, 120, 21, 5279-5290, https://doi.org/10.1021/ja9803355 . [all data]