(H2O)3 radical anion
- Formula: H6O3-
- Molecular weight: 54.0464

Gas phase ion energetics data

Data compiled by: John E. Bartmess
Electron affinity of neutral species
EAneutral (eV) | Method | Reference | Comment |
---|---|---|---|
0.130 ± 0.030 | LPES | Kim, Becker, et al., 1998 | Stated electron affinity is the Vertical Detachment Energy |

References

Kim, Becker, et al., 1998
Kim, J.; Becker, I.; Cheshnovsky, O.; Johnson, M.A.,
Photoelectron spectroscopy of the 'missing' hydrated electron clusters (H2O)n(-), n = 3, 5, 8 and 9: Isomers and continuity with the dominant clusters n = 6, 7 and =11,
Chem. Phys. Lett., 1998, 297, 1-2, 90-96, https://doi.org/10.1016/S0009-2614(98)01109-9
. [all data]