Br3 anion
- Formula: Br3-
- Molecular weight: 239.713

Gas phase thermochemistry data

Data compiled by: John E. Bartmess
Quantity | Value | Units | Method | Reference | Comment |
---|---|---|---|---|---|
ΔfH°gas | -73.8 ± 1.7 | kcal/mol | Ther | Nizzi, Pommerening, et al., 1998 |

Reaction thermochemistry data

Data compiled by: John E. Bartmess
Individual Reactions
By formula: Br3- + Br2 = (Br3- • Br2)
Quantity | Value | Units | Method | Reference | Comment |
---|---|---|---|---|---|
ΔrH° | 9.1 ± 1.7 | kcal/mol | CIDT | Nizzi, Pommerening, et al., 1998 | gas phase |

Gas phase ion energetics data

Data compiled by: John E. Bartmess
Electron affinity of neutral species
EAneutral (eV) | Reference | Comment |
---|---|---|
4.617629 | Check, Faust, et al., 2001 | Fe-; ; ΔS(EA)=5.8 |

Ion clustering data

Data compiled by: John E. Bartmess

Clustering reactions

Br3- + Bromine = (Br3- • Bromine)

By formula: Br3- + Br2 = (Br3- • Br2)

Quantity Value Units Method Reference Comment
Δr38. ± 7.1kJ/molCIDTNizzi, Pommerening, et al., 1998gas phase

References

Nizzi, Pommerening, et al., 1998
Nizzi, K.E.; Pommerening, C.A.; Sunderlin, L.S.,
Gas-phase thermochemistry of polyhalide anions,
J. Phys. Chem. A, 1998, 102, 39, 7674-7679, https://doi.org/10.1021/jp9824508
. [all data]
Check, Faust, et al., 2001
Check, C.E.; Faust, T.O.; Bailey, J.M.; Wright, B.J.; Gilbert, T.M.; Sunderlin, L.S.,
Addition of Polarization and Diffuse Functions to the LANL2DZ Basis Set for P-Block Elements,
J. Phys. Chem. A,, 2001, 105, 34, 8111, https://doi.org/10.1021/jp011945l
. [all data]