(N2O)2..HO anion

Gas phase ion energetics data

Data compiled by: John E. Bartmess

Electron affinity of neutral species

EAneutral (eV) Method Reference Comment
2.38 ± 0.17LPESKim, Wenthold, et al., 1998Vertical Detachment Energy: 2.485 eV. Affinity is EA difference with next lower +0.08 eV f

References

Kim, Wenthold, et al., 1998
Kim, J.B.; Wenthold, P.G.; Lineberger, W.C., Photoelectron spectroscopy of OH-(N2O)(n=1-5), J. Chem. Phys., 1998, 108, 3, 830-837, https://doi.org/10.1063/1.475447 . [all data]