1,2,4-trifluorophenide anion
- Formula: C6H2F3-
- Molecular weight: 131.0758

Reaction thermochemistry data

Data compiled by: John E. Bartmess
Individual Reactions
By formula: C6H2F3- + H+ = C6H3F3
Quantity | Value | Units | Method | Reference | Comment |
---|---|---|---|---|---|
ΔrH° | 370.3 ± 2.1 | kcal/mol | G+TS | Buker, Nibbering, et al., 1997 | gas phase |
Quantity | Value | Units | Method | Reference | Comment |
ΔrG° | 362.6 ± 2.0 | kcal/mol | IMRE | Buker, Nibbering, et al., 1997 | gas phase |

Gas phase ion energetics data

Data compiled by: John E. Bartmess
Protonation reactions
By formula: C6H2F3- + H+ = C6H3F3
Quantity | Value | Units | Method | Reference | Comment |
---|---|---|---|---|---|
ΔrH° | 370.3 ± 2.1 | kcal/mol | G+TS | Buker, Nibbering, et al., 1997 | gas phase |
Quantity | Value | Units | Method | Reference | Comment |
ΔrG° | 362.6 ± 2.0 | kcal/mol | IMRE | Buker, Nibbering, et al., 1997 | gas phase |

References

Buker, Nibbering, et al., 1997
Buker, H.H.; Nibbering, N.M.M.; Espinosa, D.; Mongin, F.; Schlosser, M.,
Additivity of substituent effects in the fluoroarene series: Equilibrium acidity in the gas phase and deprotonation rates in ethereal solution,
Tetrahed. Lett., 1997, 38, 49, 8519-8522, https://doi.org/10.1016/S0040-4039(97)10303-3
. [all data]