2,4-dimethylenecyclobutan-1-ide anion

Reaction thermochemistry data

Data compiled by: John E. Bartmess

Individual Reactions

C6H7- + Hydrogen cation = 1,3-Bis(methylene)cyclobutane

By formula: C6H7- + H+ = C6H8

Quantity Value Units Method Reference Comment
Δr1534. ± 13.kJ/molG+TSHill and Squires, 1998gas phase; acidity between MeCHO, (FCH2)2CHOH. Reprotonate to conjugated form, ΔGacid=361.9, IMRB
Quantity Value Units Method Reference Comment
Δr1500. ± 13.kJ/molIMRBHill and Squires, 1998gas phase; acidity between MeCHO, (FCH2)2CHOH. Reprotonate to conjugated form, ΔGacid=361.9, IMRB

References

Hill and Squires, 1998
Hill, B.T.; Squires, R.R., Synthesis and Characterization of the Negative Ion of non-Kekule` Benzene, J. Chem. Soc. Perkin Trans., 1998, 2, 5, 1027, https://doi.org/10.1039/a707470k . [all data]