CH2=C(Me)C(=CH2)CH2 anion
- Formula: C6H9-
- Molecular weight: 81.1362

Reaction thermochemistry data

Data compiled by: John E. Bartmess
Individual Reactions
By formula: C6H9- + H+ = C6H10
Quantity | Value | Units | Method | Reference | Comment |
---|---|---|---|---|---|
ΔrH° | 1624. ± 13. | kJ/mol | G+TS | Clifford, Wenthold, et al., 1998 | gas phase |
Quantity | Value | Units | Method | Reference | Comment |
ΔrG° | 1590. ± 13. | kJ/mol | IMRB | Clifford, Wenthold, et al., 1998 | gas phase |

Gas phase ion energetics data

Data compiled by: John E. Bartmess
Electron affinity of neutral species
EAneutral (eV) | Method | Reference | Comment |
---|---|---|---|
0.654 ± 0.010 | LPES | Clifford, Wenthold, et al., 1998 |
Protonation reactions
By formula: C6H9- + H+ = C6H10
Quantity | Value | Units | Method | Reference | Comment |
---|---|---|---|---|---|
ΔrH° | 1624. ± 13. | kJ/mol | G+TS | Clifford, Wenthold, et al., 1998 | gas phase |
Quantity | Value | Units | Method | Reference | Comment |
ΔrG° | 1590. ± 13. | kJ/mol | IMRB | Clifford, Wenthold, et al., 1998 | gas phase |

References

Clifford, Wenthold, et al., 1998
Clifford, E.P.; Wenthold, P.G.; Lineberger, W.C.; Ellison, G.B.; Wang, C.X.; Grabowski, J.J.; Vila, F.; Jordan,
Properties of Tetramethyleneethane (TME) as Revealed by Ion Chemistry and Ion Photoelectron Spectroscopy,
J. Chem. Soc. Perkin Trans., 1998, 2, 5, 1015, https://doi.org/10.1039/a707322d
. [all data]