fluorobenzene..V anion
- Formula: C6H5FV-
- Molecular weight: 147.0444

Gas phase thermochemistry data

Data compiled by: John E. Bartmess
Quantity | Value | Units | Method | Reference | Comment |
---|---|---|---|---|---|
ΔfH°gas | 68.8 ± 3.9 | kcal/mol | Ther | Judai, Hirano, et al., 1997 |

Gas phase ion energetics data

Data compiled by: John E. Bartmess
Electron affinity of neutral species
EAneutral (eV) | Method | Reference | Comment |
---|---|---|---|
1.15 ± 0.12 | LPES | Judai, Hirano, et al., 1997 |

References

Judai, Hirano, et al., 1997
Judai, K.; Hirano, M.; Kawamata, H.; Yabushita, S.; Nakajima, A.; Kaya, K.,
Formation of Vanadium-Arene Complex Anions and Their Photoelectron Spectroscopy,
Chem. Phys. Lett., 1997, 270, 1-2, 23, https://doi.org/10.1016/S0009-2614(97)00336-9
. [all data]