Pt5 anion
- Formula: Pt5-
- Molecular weight: 975.421

Reaction thermochemistry data

Data compiled by: John E. Bartmess
Individual Reactions
By formula: Pt5- + CO = (Pt5- • CO)
Quantity | Value | Units | Method | Reference | Comment |
---|---|---|---|---|---|
ΔrH° | 241. ± 38. | kJ/mol | N/A | Grushow and Ervin, 1997 | gas phase |

Ion clustering data

Data compiled by: John E. Bartmess
Clustering reactions
By formula: Pt5- + CO = (Pt5- • CO)
Quantity | Value | Units | Method | Reference | Comment |
---|---|---|---|---|---|
ΔrH° | 241. ± 38. | kJ/mol | N/A | Grushow and Ervin, 1997 | gas phase |

Gas phase thermochemistry data

Data compiled by: John E. Bartmess
Quantity | Value | Units | Method | Reference | Comment |
---|---|---|---|---|---|
ΔfH°gas | 246. ± 14. | kcal/mol | Ther | Grushow and Ervin, 1997 |

References

Grushow and Ervin, 1997
Grushow, A.; Ervin, K.M.,
Ligand and Metal Binding Energies in Platinum Carbonyl Cluster Anions: Collision Induced Dissociation of PtM- and Ptm(CO)n-,
J. Chem. Phys., 1997, 106, 23, 9580, https://doi.org/10.1063/1.474116
. [all data]