Pt4 anion
- Formula: Pt4-
- Molecular weight: 780.337

Reaction thermochemistry data

Data compiled by: John E. Bartmess
Individual Reactions
By formula: Pt4- + CO = (Pt4- • CO)
Quantity | Value | Units | Method | Reference | Comment |
---|---|---|---|---|---|
ΔrH° | 251. ± 38. | kJ/mol | N/A | Grushow and Ervin, 1997 | gas phase |

Ion clustering data

Data compiled by: John E. Bartmess
Clustering reactions
By formula: Pt4- + CO = (Pt4- • CO)
Quantity | Value | Units | Method | Reference | Comment |
---|---|---|---|---|---|
ΔrH° | 251. ± 38. | kJ/mol | N/A | Grushow and Ervin, 1997 | gas phase |

References

Grushow and Ervin, 1997
Grushow, A.; Ervin, K.M.,
Ligand and Metal Binding Energies in Platinum Carbonyl Cluster Anions: Collision Induced Dissociation of PtM- and Ptm(CO)n-,
J. Chem. Phys., 1997, 106, 23, 9580, https://doi.org/10.1063/1.474116
. [all data]