CO..Pt3(CO)5 radical anion
- Formula: C6O6Pt3-
- Molecular weight: 753.313

Reaction thermochemistry data

Data compiled by: John E. Bartmess
Individual Reactions
C5O5Pt3- + = C6O6Pt3-
By formula: C5O5Pt3- + CO = C6O6Pt3-
Quantity | Value | Units | Method | Reference | Comment |
---|---|---|---|---|---|
ΔrH° | 174. ± 29. | kJ/mol | N/A | Grushow and Ervin, 1997 | gas phase |
ΔrH° | 166. ± 14. | kJ/mol | PDis | Shi, Spasov, et al., 2001 | gas phase |

Ion clustering data

Data compiled by: John E. Bartmess
Clustering reactions
C5O5Pt3- + = C6O6Pt3-
By formula: C5O5Pt3- + CO = C6O6Pt3-
Quantity | Value | Units | Method | Reference | Comment |
---|---|---|---|---|---|
ΔrH° | 174. ± 29. | kJ/mol | N/A | Grushow and Ervin, 1997 | gas phase |
ΔrH° | 166. ± 14. | kJ/mol | PDis | Shi, Spasov, et al., 2001 | gas phase |

Gas phase thermochemistry data

Data compiled by: John E. Bartmess

Quantity Value Units Method Reference Comment
Δfgas-925. ± 79.kJ/molTherGrushow and Ervin, 1997

References

Grushow and Ervin, 1997
Grushow, A.; Ervin, K.M.,
Ligand and Metal Binding Energies in Platinum Carbonyl Cluster Anions: Collision Induced Dissociation of PtM- and Ptm(CO)n-,
J. Chem. Phys., 1997, 106, 23, 9580, https://doi.org/10.1063/1.474116
. [all data]
Shi, Spasov, et al., 2001
Shi, Y.; Spasov, V.A.; Ervin, K.M.,
Photodesorption of carbonyl from Pt-3(CO)(n)(-) (n=1-6),
Int. J. Mass Spectrom., 2001, 204, 1-3, 197-208, https://doi.org/10.1016/S1387-3806(00)00364-X
. [all data]